{"text_format":"1","workbook":"xlsx","n_sheets":5,"sheets":["Master Pay Items_Full_Item No_2","Form SPA-1DB","2018 Eligible List","2024 Eligible List","Sheet3"],"not_rendered":{"charts":0,"images":0,"macros":0,"external_links":0,"defined_names":0,"comments":0,"pivot_tables":0},"unopened":[],"bounds":{"document_bytes":16777216,"sheet_cells":100000,"rows_first":2000,"rows_last":500,"rows_between":2000,"halvings":0,"cell_chars":16384,"cell_head_chars":4096},"cells_cut":0,"cells_raw":0,"read":"whole","date_system":"1900"}

{"sheet":"Master Pay Items_Full_Item No_2","index":0,"n_rows":1262,"n_cols":6,"rows_kept":1262,"cut":false,"hidden":false,"merged":[]}
["Pay Item ID","Item Number","Long Description","Unit of Measure","Section Number","Category Description"]
[88405,"8007000000-N","CONSTRUCTION, MAINTENANCE, &  REMOVAL OF TEMP STRUCTURE ATSTA ************,","Lump Sum",400,"Bridge(B)"]
[88407,"8014000000-N","TEMPORARY RAILROAD SHORING FORBENT ***, STATION ***********,","Lump Sum",9000,"Bridge(B)"]
[88409,"8017000000-N","CONSTRUCTION, MAINTENANCE, &  REMOVAL OF TEMP ACCESS AT STA************,","Lump Sum",9000,"Bridge(B)"]
[88432,"8105500000-E","**'-** DIA DRILLED PIERS IN  SOIL,\"","Linear Feet",411,"Bridge(B)"]
[88433,"8105520000-E","3'-0 DIA DRILLED PIERS IN    SOIL,\"","Linear Feet",411,"Bridge(B)"]
[88434,"8105540000-E","3'-6 DIA DRILLED PIERS IN    SOIL,\"","Linear Feet",411,"Bridge(B)"]
[88435,"8105560000-E","4'-0 DIA DRILLED PIERS IN    SOIL,\"","Linear Feet",411,"Bridge(B)"]
[88436,"8105600000-E","**'-** DIA DRILLED PIERS NOT IN SOIL,\"","Linear Feet",411,"Bridge(B)"]
[88437,"8105620000-E","3'-0 DIA DRILLED PIERS NOT IN SOIL,\"","Linear Feet",411,"Bridge(B)"]
[88438,"8105640000-E","3'-6 DIA DRILLED PIERS NOT IN SOIL,\"","Linear Feet",411,"Bridge(B)"]
[88439,"8105660000-E","4'-0 DIA DRILLED PIERS NOT IN SOIL,\"","Linear Feet",411,"Bridge(B)"]
[88440,"8108000000-E","**'-** DIA DRILLED PIERS,\"","Linear Feet",411,"Bridge(B)"]
[88441,"8111000000-E","PERMANENT STEEL CASING FOR    **'-** DIA DRILLED PIER,\"","Linear Feet",411,"Bridge(B)"]
[88442,"8111200000-E","PERMANENT STEEL CASING FOR    3'-0 DIA DRILLED PIER,\"","Linear Feet",411,"Bridge(B)"]
[88443,"8111400000-E","PERMANENT STEEL CASING FOR    3'-6 DIA DRILLED PIER,\"","Linear Feet",411,"Bridge(B)"]
[88444,"8111600000-E","PERMANENT STEEL CASING FOR    4'-0 DIA DRILLED PIER,\"","Linear Feet",411,"Bridge(B)"]
[88459,"8147000000-E","REINFORCED CONCRETE DECK SLAB,","Square Feet",420,"Bridge(B)"]
[88460,"8154000000-E","REINFORCED CONCRETE DECK SLAB (SAND LIGHTWEIGHT CONC),","Square Feet",420,"Bridge(B)"]
[88463,"8168000000-E","CLASS AAA CONCRETE (BRIDGE),","Cubic Yards",420,"Bridge(B)"]
[88464,"8175000000-E","CLASS AA CONCRETE (BRIDGE),","Cubic Yards",420,"Bridge(B)"]
[88465,"8182000000-E","CLASS A CONCRETE (BRIDGE),","Cubic Yards",420,"Bridge(B)"]
[88466,"8189000000-E","CLASS S CONCRETE (SEAL),","Cubic Yards",9000,"Bridge(B)"]
[88470,"8210000000-N","BRIDGE APPROACH SLABS, STATION************,","Lump Sum",422,"Bridge(B)"]
[88471,"8217000000-E","REINFORCING STEEL (BRIDGE),","Pounds",425,"Bridge(B)"]
[88472,"8224000000-E","EPOXY COATED REINFORCING STEEL(BRIDGE),","Pounds",425,"Bridge(B)"]
[88473,"8226000000-E","EPOXY COATED SPIRAL COLUMN RE-INFORCING STEEL (BRIDGE),","Pounds",425,"Bridge(B)"]
[88474,"8238000000-E","SPIRAL COLUMN REINFORCING     STEEL (BRIDGE),","Pounds",425,"Bridge(B)"]
[88478,"8256000000-E","TYPE III PRESRESSED CONCRETE  DECK GIRDER,","Linear Feet",9000,"Bridge(B)"]
[88479,"8259000000-E","36 PRESTRESSED CONCRETE GIR- DERS,\"","Linear Feet",430,"Bridge(B)"]
[88480,"8262000000-E","45 PRESTRESSED CONCRETE GIR- DERS,\"","Linear Feet",430,"Bridge(B)"]
[88481,"8265000000-E","54 PRESTRESSED CONCRETE GIR- DERS,\"","Linear Feet",430,"Bridge(B)"]
[88482,"8268000000-E","63 PRESTRESSED CONCRETE GIR- DERS,\"","Linear Feet",430,"Bridge(B)"]
[88483,"8271000000-E","72 PRESTRESSED CONCRETE GIR- DERS,\"","Linear Feet",430,"Bridge(B)"]
[88484,"8274000000-E","MODIFIED 63 PRESTRESSED CONC GIRDERS,\"","Linear Feet",430,"Bridge(B)"]
[88485,"8277000000-E","MODIFIED 72 PRESTRESSED CONC GIRDERS,\"","Linear Feet",430,"Bridge(B)"]
[88486,"8280000000-E","APPROX ........ LBS STRUCTURALSTEEL,","Lump Sum",440,"Bridge(B)"]
[88488,"8294000000-N","PAINTING OF STRUCTURAL STEEL,","Lump Sum",442,"Bridge(B)"]
[88491,"8322000000-E","TREATED TIMBER PILES,","Linear Feet",9000,"Bridge(B)"]
[88492,"8329000000-E","12 PRESTRESSED CONCRETE PILES,\"","Linear Feet",450,"Bridge(B)"]
{"$rows_left_out":1223}
{"sheet":"Form SPA-1DB","index":1,"n_rows":43,"n_cols":8,"rows_kept":43,"cut":false,"hidden":false,"merged":[[38,2,38,3],[39,1,39,3],[9,1,9,2],[9,3,9,6],[34,2,34,3],[35,2,35,3],[36,2,36,3],[37,2,37,3],[15,2,15,3],[16,2,16,3],[17,2,17,3],[18,2,18,3],[19,2,19,3],[20,2,20,3],[1,2,1,3],[2,2,2,3],[3,2,3,3],[4,2,4,3],[33,2,33,3],[28,2,28,3],[29,2,29,3],[30,2,30,3],[31,2,31,3],[32,2,32,3],[23,2,23,3],[24,2,24,3],[25,2,25,3],[26,2,26,3],[27,2,27,3],[13,2,14,3],[21,2,21,3],[22,2,22,3],[13,1,14,1],[13,4,14,4],[6,1,6,7],[13,5,14,5],[11,1,11,7],[13,6,14,6],[8,1,8,7],[43,6,43,7],[40,6,41,7],[39,4,39,7],[42,4,42,7],[40,2,40,3],[41,2,41,3],[42,1,42,3],[43,1,43,3]]}
[null,null,null,null,null,null,null,"Form SPA-1 DB"]
[null,"Contract Number",null,null,null,null,null,"Revised 10-24-2023"]
[null,"TIP Number",null,null,null,null,null,"Page ____ of _____"]
[null,"Standard Specifications Year"]
[null,"County and Route"]
[]
[null,"Work Items Eligible for Steel Price Adjustment"]
[]
[null,"Must be supplied with Price Proposal for Department Participation"]
[null,"DATE FOR RECEIPT OF PRICE PROPOSAL :"]
[]
[null,"Instructions: This form shall be completed in accordance with the Design-Build Steel Price Adjustment Project Special Provision found elsewhere in this RFP.  If you choose to have Steel Price Adjustments applied to any of the items listed below, write the word “Yes” in the “Option” column corresponding to the item.  The form must be signed, dated, and submitted with the Price Proposal for Department Participation."]
[]
[null,"Work Item Number","Item Number and Description",null,"Trns*Port Item Number","Long Description ","Category","Option"]
[null,null,null,null,null,null,null,"(Yes or No)"]
[null,null,null,null,null,null,{"$f":"IF(C16=\"\",\"\",IF($C$4=2018,VLOOKUP(C16,'2018 Eligible List'!A:G,4,FALSE),VLOOKUP(C16,'2024 Eligible List'!A:G,4,FALSE)))","v":""}]
[null,null,null,null,null,null,{"$f":"IF(C17=\"\",\"\",IF($C$4=2018,VLOOKUP(C17,'2018 Eligible List'!A:G,4,FALSE),VLOOKUP(C17,'2024 Eligible List'!A:G,4,FALSE)))","v":""}]
[null,null,null,null,null,null,{"$f":"IF(C18=\"\",\"\",IF($C$4=2018,VLOOKUP(C18,'2018 Eligible List'!A:G,4,FALSE),VLOOKUP(C18,'2024 Eligible List'!A:G,4,FALSE)))","v":""}]
[null,null,null,null,null,null,{"$f":"IF(C19=\"\",\"\",IF($C$4=2018,VLOOKUP(C19,'2018 Eligible List'!A:G,4,FALSE),VLOOKUP(C19,'2024 Eligible List'!A:G,4,FALSE)))","v":""}]
[null,null,null,null,null,null,{"$f":"IF(C20=\"\",\"\",IF($C$4=2018,VLOOKUP(C20,'2018 Eligible List'!A:G,4,FALSE),VLOOKUP(C20,'2024 Eligible List'!A:G,4,FALSE)))","v":""}]
[null,null,null,null,null,null,{"$f":"IF(C21=\"\",\"\",IF($C$4=2018,VLOOKUP(C21,'2018 Eligible List'!A:G,4,FALSE),VLOOKUP(C21,'2024 Eligible List'!A:G,4,FALSE)))","v":""}]
[null,null,null,null,null,null,{"$f":"IF(C22=\"\",\"\",IF($C$4=2018,VLOOKUP(C22,'2018 Eligible List'!A:G,4,FALSE),VLOOKUP(C22,'2024 Eligible List'!A:G,4,FALSE)))","v":""}]
[null,null,null,null,null,null,{"$f":"IF(C23=\"\",\"\",IF($C$4=2018,VLOOKUP(C23,'2018 Eligible List'!A:G,4,FALSE),VLOOKUP(C23,'2024 Eligible List'!A:G,4,FALSE)))","v":""}]
[null,null,null,null,null,null,{"$f":"IF(C24=\"\",\"\",IF($C$4=2018,VLOOKUP(C24,'2018 Eligible List'!A:G,4,FALSE),VLOOKUP(C24,'2024 Eligible List'!A:G,4,FALSE)))","v":""}]
[null,null,null,null,null,null,{"$f":"IF(C25=\"\",\"\",IF($C$4=2018,VLOOKUP(C25,'2018 Eligible List'!A:G,4,FALSE),VLOOKUP(C25,'2024 Eligible List'!A:G,4,FALSE)))","v":""}]
[null,null,null,null,null,null,{"$f":"IF(C26=\"\",\"\",IF($C$4=2018,VLOOKUP(C26,'2018 Eligible List'!A:G,4,FALSE),VLOOKUP(C26,'2024 Eligible List'!A:G,4,FALSE)))","v":""}]
[null,null,null,null,null,null,{"$f":"IF(C27=\"\",\"\",IF($C$4=2018,VLOOKUP(C27,'2018 Eligible List'!A:G,4,FALSE),VLOOKUP(C27,'2024 Eligible List'!A:G,4,FALSE)))","v":""}]
[null,null,null,null,null,null,{"$f":"IF(C28=\"\",\"\",IF($C$4=2018,VLOOKUP(C28,'2018 Eligible List'!A:G,4,FALSE),VLOOKUP(C28,'2024 Eligible List'!A:G,4,FALSE)))","v":""}]
[null,null,null,null,null,null,{"$f":"IF(C29=\"\",\"\",IF($C$4=2018,VLOOKUP(C29,'2018 Eligible List'!A:G,4,FALSE),VLOOKUP(C29,'2024 Eligible List'!A:G,4,FALSE)))","v":""}]
[null,null,null,null,null,null,{"$f":"IF(C30=\"\",\"\",IF($C$4=2018,VLOOKUP(C30,'2018 Eligible List'!A:G,4,FALSE),VLOOKUP(C30,'2024 Eligible List'!A:G,4,FALSE)))","v":""}]
[null,null,null,null,null,null,{"$f":"IF(C31=\"\",\"\",IF($C$4=2018,VLOOKUP(C31,'2018 Eligible List'!A:G,4,FALSE),VLOOKUP(C31,'2024 Eligible List'!A:G,4,FALSE)))","v":""}]
[null,null,null,null,null,null,{"$f":"IF(C32=\"\",\"\",IF($C$4=2018,VLOOKUP(C32,'2018 Eligible List'!A:G,4,FALSE),VLOOKUP(C32,'2024 Eligible List'!A:G,4,FALSE)))","v":""}]
[null,null,null,null,null,null,{"$f":"IF(C33=\"\",\"\",IF($C$4=2018,VLOOKUP(C33,'2018 Eligible List'!A:G,4,FALSE),VLOOKUP(C33,'2024 Eligible List'!A:G,4,FALSE)))","v":""}]
[null,null,null,null,null,null,{"$f":"IF(C34=\"\",\"\",IF($C$4=2018,VLOOKUP(C34,'2018 Eligible List'!A:G,4,FALSE),VLOOKUP(C34,'2024 Eligible List'!A:G,4,FALSE)))","v":""}]
[null,null,null,null,null,null,{"$f":"IF(C35=\"\",\"\",IF($C$4=2018,VLOOKUP(C35,'2018 Eligible List'!A:G,4,FALSE),VLOOKUP(C35,'2024 Eligible List'!A:G,4,FALSE)))","v":""}]
[null,null,null,null,null,null,{"$f":"IF(C36=\"\",\"\",IF($C$4=2018,VLOOKUP(C36,'2018 Eligible List'!A:G,4,FALSE),VLOOKUP(C36,'2024 Eligible List'!A:G,4,FALSE)))","v":""}]
[null,null,null,null,null,null,{"$f":"IF(C37=\"\",\"\",IF($C$4=2018,VLOOKUP(C37,'2018 Eligible List'!A:G,4,FALSE),VLOOKUP(C37,'2024 Eligible List'!A:G,4,FALSE)))","v":""}]
[null,null,null,null,null,null,{"$f":"IF(C38=\"\",\"\",IF($C$4=2018,VLOOKUP(C38,'2018 Eligible List'!A:G,4,FALSE),VLOOKUP(C38,'2024 Eligible List'!A:G,4,FALSE)))","v":""}]
[null,null,null,null,null,null,{"$f":"IF(C39=\"\",\"\",IF($C$4=2018,VLOOKUP(C39,'2018 Eligible List'!A:G,4,FALSE),VLOOKUP(C39,'2024 Eligible List'!A:G,4,FALSE)))","v":""}]
[null,"Signature  (Print and Sign Your Name)",null,null,"Firm or Corporation"]
{"$rows_left_out":4}
{"sheet":"2018 Eligible List","index":2,"n_rows":140,"n_cols":7,"rows_kept":140,"cut":false,"hidden":false,"merged":[]}
["Item Number and Long Description","Item Number","Long Description","Category","Unit of Measure","Section Number","Category Description"]
[{"$f":"CONCATENATE(B2,\" - \",C2)","v":"1735000000-E - REPAIR OF JOINTED CONCRETE    PAVEMENT SLABS,"},"1735000000-E","REPAIR OF JOINTED CONCRETE    PAVEMENT SLABS,",1,"Square Yards",723,"Paving"]
[{"$f":"CONCATENATE(B3,\" - \",C3)","v":"1847000000-E - ***** PORT CEM CONC PAVEMENT,THROUGH LANES (WITH DOWELS),\""},"1847000000-E","***** PORT CEM CONC PAVEMENT,THROUGH LANES (WITH DOWELS),\"",1,"Square Yards",710,"Paving"]
["1858000000-E - ***** PORT CEM CONC PAVEMENT,RAMPS (WITH DOWELS),\"","1858000000-E","***** PORT CEM CONC PAVEMENT,RAMPS (WITH DOWELS),\"",1,"Square Yards",710,"Paving"]
["2703000000-E - CONCRETE BARRIER, TYPE *******,","2703000000-E","CONCRETE BARRIER, TYPE *******,",1,"Linear Feet",854,"Paving"]
["2710000000-N - CONCRETE BARRIER TRANSITION   SECTION,","2710000000-N","CONCRETE BARRIER TRANSITION   SECTION,",1,"Each",854,"Paving"]
["2717000000-E - VARIABLE HEIGHT CONCRETE BAR- RIER, TYPE ************,","2717000000-E","VARIABLE HEIGHT CONCRETE BAR- RIER, TYPE ************,",1,"Linear Feet",854,"Paving"]
["3000000000-N - IMPACT ATTENUATOR UNIT, TYPE  350,","3000000000-N","IMPACT ATTENUATOR UNIT, TYPE  350,",4,"Each",9000,"Guardrail (GR)"]
["3001000000-N - IMPACT ATTENUATOR UNITS, TYPE  TL-3,","3001000000-N","IMPACT ATTENUATOR UNITS, TYPE  TL-3,",4,"Each",9000,"Guardrail (GR)"]
["3001500000-N - IMPACT ATTENUATOR UNITS, TYPE  TL-2,","3001500000-N","IMPACT ATTENUATOR UNITS, TYPE  TL-2,",4,"Each",9000,"Guardrail (GR)"]
["3030000000-E - STEEL BEAM GUARDRAIL,","3030000000-E","STEEL BEAM GUARDRAIL,",4,"Linear Feet",862,"Guardrail (GR)"]
["3045000000-E - STEEL BEAM GUARDRAIL, SHOP    CURVED,","3045000000-E","STEEL BEAM GUARDRAIL, SHOP    CURVED,",4,"Linear Feet",862,"Guardrail (GR)"]
["3060000000-E - STEEL BEAM GUARDRAIL, DOUBLE  FACED,","3060000000-E","STEEL BEAM GUARDRAIL, DOUBLE  FACED,",4,"Linear Feet",862,"Guardrail (GR)"]
["3075000000-E - TRIPLE CORRUGATED STEEL BM    GUARDRAIL,","3075000000-E","TRIPLE CORRUGATED STEEL BM    GUARDRAIL,",4,"Linear Feet",862,"Guardrail (GR)"]
["3090000000-N - TRIPLE CORRUGATED STEEL BEAMGUARDRAIL TERMINAL SECTIONS,","3090000000-N","TRIPLE CORRUGATED STEEL BEAMGUARDRAIL TERMINAL SECTIONS,",4,"Each",862,"Guardrail (GR)"]
["3105000000-N - STEEL BEAM GUARDRAIL TERMINAL SECTIONS,","3105000000-N","STEEL BEAM GUARDRAIL TERMINAL SECTIONS,",4,"Each",862,"Guardrail (GR)"]
["3120000000-E - 20 TUBULAR TRIPLE CORRUGATEDSTEEL BEAM GUARDRAIL,\"","3120000000-E","20 TUBULAR TRIPLE CORRUGATEDSTEEL BEAM GUARDRAIL,\"",4,"Linear Feet",862,"Guardrail (GR)"]
["3135000000-N - W-TR STEEL BEAM GUARDRAILTRANSITION SECTIONS,","3135000000-N","W-TR STEEL BEAM GUARDRAILTRANSITION SECTIONS,",4,"Each",862,"Guardrail (GR)"]
["3140000000-E - 25' CLEAR SPAN GUARDRAIL SEC- TIONS,","3140000000-E","25' CLEAR SPAN GUARDRAIL SEC- TIONS,",4,"Each",862,"Guardrail (GR)"]
["3145000000-E - EXTRA LENGTH GUARDRAIL POST   (**' STEEL),","3145000000-E","EXTRA LENGTH GUARDRAIL POST   (**' STEEL),",4,"Each",862,"Guardrail (GR)"]
["3150000000-N - ADDITIONAL GUARDRAIL POSTS,","3150000000-N","ADDITIONAL GUARDRAIL POSTS,",4,"Each",862,"Guardrail (GR)"]
["3165500000-N - GUARDRAIL END UNITS, TYPE     ************,","3165500000-N","GUARDRAIL END UNITS, TYPE     ************,",4,"Each",862,"Guardrail (GR)"]
["3195000000-N - GUARDRAIL END UNITS, TYPE     AT-1,","3195000000-N","GUARDRAIL END UNITS, TYPE     AT-1,",4,"Each",863,"Guardrail (GR)"]
["3210000000-N - GUARDRAIL END UNITS, TYPE     CAT-1,","3210000000-N","GUARDRAIL END UNITS, TYPE     CAT-1,",4,"Each",862,"Guardrail (GR)"]
["3215000000-N - GUARDRAIL ANCHOR UNITS, TYPE  III,","3215000000-N","GUARDRAIL ANCHOR UNITS, TYPE  III,",4,"Each",9000,"Guardrail (GR)"]
["3287000000-N - GUARDRAIL END UNITS, TYPE TL-3,","3287000000-N","GUARDRAIL END UNITS, TYPE TL-3,",4,"Each",9000,"Guardrail (GR)"]
["3288000000-N - GUARDRAIL END UNITS, TYPE TL-2,","3288000000-N","GUARDRAIL END UNITS, TYPE TL-2,",4,"Each",9000,"Guardrail (GR)"]
["3289000000-N - GUARDRAIL END UNITS, TYPE     MEDIAN TL-3,","3289000000-N","GUARDRAIL END UNITS, TYPE     MEDIAN TL-3,",4,"Each",9000,"Guardrail (GR)"]
["3317000000-N - GUARDRAIL ANCHOR UNITS, TYPE  B-77,","3317000000-N","GUARDRAIL ANCHOR UNITS, TYPE  B-77,",4,"Each",9000,"Guardrail (GR)"]
["3319000000-N - GUARDRAIL ANCHOR UNITS, TYPE  B-83,","3319000000-N","GUARDRAIL ANCHOR UNITS, TYPE  B-83,",4,"Each",9000,"Guardrail (GR)"]
["3389200000-E - CABLE GUIDERAIL,","3389200000-E","CABLE GUIDERAIL,",4,"Linear Feet",865,"Guardrail (GR)"]
["3389400000-E - DOUBLE FACED CABLE GUIDERAIL,","3389400000-E","DOUBLE FACED CABLE GUIDERAIL,",4,"Linear Feet",865,"Guardrail (GR)"]
["3389500000-N - ADDITIONAL GUIDERAIL POSTS,","3389500000-N","ADDITIONAL GUIDERAIL POSTS,",4,"Each",865,"Guardrail (GR)"]
["3500000000-E - WOVEN WIRE FENCE, ** FABRIC,\"","3500000000-E","WOVEN WIRE FENCE, ** FABRIC,\"",5,"Linear Feet",866,"Fence(F)"]
["3503000000-E - WOVEN WIRE FENCE, 47 FABRIC,\"","3503000000-E","WOVEN WIRE FENCE, 47 FABRIC,\"",5,"Linear Feet",866,"Fence(F)"]
["3518000000-E - CHAIN LINK FENCE, ** FABRIC  WITH REDWOOD PICKETS,\"","3518000000-E","CHAIN LINK FENCE, ** FABRIC  WITH REDWOOD PICKETS,\"",5,"Linear Feet",9000,"Fence(F)"]
["3521000000-E - VINYL COATED CHAIN LINK FENCE,** FABRIC WITH REDWOOD PIC-KETS,\"","3521000000-E","VINYL COATED CHAIN LINK FENCE,** FABRIC WITH REDWOOD PIC-KETS,\"",5,"Linear Feet",9000,"Fence(F)"]
["3524000000-E - VINYL COATED CHAIN LINK FENCE,** FABRIC,\"","3524000000-E","VINYL COATED CHAIN LINK FENCE,** FABRIC,\"",5,"Linear Feet",9000,"Fence(F)"]
["3527000000-E - CHAIN LINK FENCE, ** FABRIC, GUARDRAIL MOUNTED,\"","3527000000-E","CHAIN LINK FENCE, ** FABRIC, GUARDRAIL MOUNTED,\"",5,"Linear Feet",9000,"Fence(F)"]
["3530000000-E - CHAIN LINK FENCE, ** FABRIC  WITH 1\" MESH,\"","3530000000-E","CHAIN LINK FENCE, ** FABRIC  WITH 1\" MESH,\"",5,"Linear Feet",9000,"Fence(F)"]
{"$rows_left_out":101}
{"sheet":"2024 Eligible List","index":3,"n_rows":215,"n_cols":7,"rows_kept":215,"cut":false,"hidden":false,"merged":[]}
["Item Number and Long Description","Item Number","Long Description","Category","Unit of Measure","Section Number","Category Description"]
[{"$f":"CONCATENATE(B2,\" - \",C2)","v":"1735000000-E - REPAIR OF JOINTED CONCRETE PAVEMENT SLABS"},"1735000000-E","REPAIR OF JOINTED CONCRETE PAVEMENT SLABS",1,"Square Yards",723,"Paving"]
[{"$f":"CONCATENATE(B3,\" - \",C3)","v":"1847000000-E - *****\" PORT CEM CONC PAVEMENT, THROUGH LANES (WITH DOWELS)"},"1847000000-E","*****\" PORT CEM CONC PAVEMENT, THROUGH LANES (WITH DOWELS)",1,"Square Yards",710,"Paving"]
[{"$f":"CONCATENATE(B4,\" - \",C4)","v":"1858000000-E - *****\" PORT CEM CONC PAVEMENT, RAMPS (WITH DOWELS)"},"1858000000-E","*****\" PORT CEM CONC PAVEMENT, RAMPS (WITH DOWELS)",1,"Square Yards",710,"Paving"]
["2703000000-E - CONCRETE BARRIER, TYPE *******","2703000000-E","CONCRETE BARRIER, TYPE *******",1,"Linear Feet",854,"Paving"]
["2710000000-N - CONCRETE BARRIER TRANSITION SECTION","2710000000-N","CONCRETE BARRIER TRANSITION SECTION",1,"Each",854,"Paving"]
["2717000000-E - VARIABLE HEIGHT CONCRETE BARRIER,\nTYPE ************","2717000000-E","VARIABLE HEIGHT CONCRETE BARRIER,\nTYPE ************",1,"Linear Feet",854,"Paving"]
["3000000000-N - IMPACT ATTENUATOR UNIT, TYPE 350","3000000000-N","IMPACT ATTENUATOR UNIT, TYPE 350",4,"Each",9000,"Guardrail (GR)"]
["3001000000-N - IMPACT ATTENUATOR UNITS, TYPE TL-3","3001000000-N","IMPACT ATTENUATOR UNITS, TYPE TL-3",4,"Each",9000,"Guardrail (GR)"]
["3001500000-N - IMPACT ATTENUATOR UNITS, TYPE TL-2","3001500000-N","IMPACT ATTENUATOR UNITS, TYPE TL-2",4,"Each",9000,"Guardrail (GR)"]
["3030000000-E - STEEL BEAM GUARDRAIL","3030000000-E","STEEL BEAM GUARDRAIL",4,"Linear Feet",862,"Guardrail (GR)"]
["3045000000-E - STEEL BEAM GUARDRAIL, SHOP CURVED","3045000000-E","STEEL BEAM GUARDRAIL, SHOP CURVED",4,"Linear Feet",862,"Guardrail (GR)"]
["3060000000-E - STEEL BEAM GUARDRAIL, DOUBLE FACED","3060000000-E","STEEL BEAM GUARDRAIL, DOUBLE FACED",4,"Linear Feet",862,"Guardrail (GR)"]
["3075000000-E - TRIPLE CORRUGATED STEEL BEAM GUARDRAIL","3075000000-E","TRIPLE CORRUGATED STEEL BEAM GUARDRAIL",4,"Linear Feet",862,"Guardrail (GR)"]
["3090000000-N - TRIPLE CORRUGATED STEEL BEAM GUARDRAIL TERMINAL SECTIONS","3090000000-N","TRIPLE CORRUGATED STEEL BEAM GUARDRAIL TERMINAL SECTIONS",4,"Each",862,"Guardrail (GR)"]
["3105000000-N - STEEL BEAM GUARDRAIL TERMINAL SECTIONS","3105000000-N","STEEL BEAM GUARDRAIL TERMINAL SECTIONS",4,"Each",862,"Guardrail (GR)"]
["3120000000-E - 20\" TUBULAR TRIPLE CORRUGATED STEEL BEAM GUARDRAIL","3120000000-E","20\" TUBULAR TRIPLE CORRUGATED STEEL BEAM GUARDRAIL",4,"Linear Feet",862,"Guardrail (GR)"]
["3135000000-N - W-TR STEEL BEAM GUARDRAIL TRANSITION SECTIONS","3135000000-N","W-TR STEEL BEAM GUARDRAIL TRANSITION SECTIONS",4,"Each",862,"Guardrail (GR)"]
["3140000000-E - 25' CLEAR SPAN GUARDRAIL SECTIONS","3140000000-E","25' CLEAR SPAN GUARDRAIL SECTIONS",4,"Each",862,"Guardrail (GR)"]
["3145000000-E - EXTRA LENGTH GUARDRAIL POST (**' STEEL)","3145000000-E","EXTRA LENGTH GUARDRAIL POST (**' STEEL)",4,"Each",862,"Guardrail (GR)"]
["3150000000-N - ADDITIONAL GUARDRAIL POSTS","3150000000-N","ADDITIONAL GUARDRAIL POSTS",4,"Each",862,"Guardrail (GR)"]
["3165500000-N - GUARDRAIL END UNITS, TYPE ************","3165500000-N","GUARDRAIL END UNITS, TYPE ************",4,"Each",862,"Guardrail (GR)"]
["3195000000-N - GUARDRAIL END UNITS, TYPE AT-1","3195000000-N","GUARDRAIL END UNITS, TYPE AT-1",4,"Each",862,"Guardrail (GR)"]
["3210000000-N - GUARDRAIL END UNITS, TYPE CAT-1","3210000000-N","GUARDRAIL END UNITS, TYPE CAT-1",4,"Each",862,"Guardrail (GR)"]
["3215000000-N - GUARDRAIL ANCHOR UNITS, TYPE III","3215000000-N","GUARDRAIL ANCHOR UNITS, TYPE III",4,"Each",862,"Guardrail (GR)"]
["3287000000-N - GUARDRAIL END UNITS, TYPE TL-3","3287000000-N","GUARDRAIL END UNITS, TYPE TL-3",4,"Each",862,"Guardrail (GR)"]
["3288000000-N - GUARDRAIL END UNITS, TYPE TL-2","3288000000-N","GUARDRAIL END UNITS, TYPE TL-2",4,"Each",862,"Guardrail (GR)"]
["3289000000-N - GUARDRAIL END UNITS, TYPE MEDIAN TL-3","3289000000-N","GUARDRAIL END UNITS, TYPE MEDIAN TL-3",4,"Each",862,"Guardrail (GR)"]
["3317000000-N - GUARDRAIL ANCHOR UNITS, TYPE B-77","3317000000-N","GUARDRAIL ANCHOR UNITS, TYPE B-77",4,"Each",862,"Guardrail (GR)"]
["3319000000-N - GUARDRAIL ANCHOR UNITS, TYPE B-83","3319000000-N","GUARDRAIL ANCHOR UNITS, TYPE B-83",4,"Each",862,"Guardrail (GR)"]
["3389200000-E - CABLE GUIDERAIL","3389200000-E","CABLE GUIDERAIL",4,"Linear Feet",865,"Guardrail (GR)"]
["3389400000-E - DOUBLE FACED CABLE GUIDERAIL","3389400000-E","DOUBLE FACED CABLE GUIDERAIL",4,"Linear Feet",865,"Guardrail (GR)"]
["3389500000-N - ADDITIONAL GUIDERAIL POSTS","3389500000-N","ADDITIONAL GUIDERAIL POSTS",4,"Each",865,"Guardrail (GR)"]
["3500000000-E - WOVEN WIRE FENCE, **\" FABRIC","3500000000-E","WOVEN WIRE FENCE, **\" FABRIC",5,"Linear Feet",866,"Fence(F)"]
["3503000000-E - WOVEN WIRE FENCE, 47\" FABRIC","3503000000-E","WOVEN WIRE FENCE, 47\" FABRIC",5,"Linear Feet",866,"Fence(F)"]
["3518000000-E - CHAIN LINK FENCE, **\" FABRIC WITH REDWOOD PICKETS","3518000000-E","CHAIN LINK FENCE, **\" FABRIC WITH REDWOOD PICKETS",5,"Linear Feet",9000,"Fence(F)"]
["3521000000-E - VINYL COATED CHAIN LINK FENCE, **\" FABRIC WITH REDWOOD PICKETS","3521000000-E","VINYL COATED CHAIN LINK FENCE, **\" FABRIC WITH REDWOOD PICKETS",5,"Linear Feet",9000,"Fence(F)"]
["3524000000-E - VINYL COATED CHAIN LINK FENCE, **\" FABRIC","3524000000-E","VINYL COATED CHAIN LINK FENCE, **\" FABRIC",5,"Linear Feet",9000,"Fence(F)"]
["3527000000-E - CHAIN LINK FENCE, **\" FABRIC, GUARDRAIL MOUNTED","3527000000-E","CHAIN LINK FENCE, **\" FABRIC, GUARDRAIL MOUNTED",5,"Linear Feet",9000,"Fence(F)"]
["3530000000-E - CHAIN LINK FENCE, **\" FABRIC WITH 1\" MESH","3530000000-E","CHAIN LINK FENCE, **\" FABRIC WITH 1\" MESH",5,"Linear Feet",9000,"Fence(F)"]
{"$rows_left_out":176}
{"sheet":"Sheet3","index":4,"n_rows":2,"n_cols":1,"rows_kept":2,"cut":false,"hidden":true,"merged":[]}
[]
["Enter Spec Year"]